Reaction Details
TargetDisintegrin and metalloproteinase domain-containing protein 17
LigandBDBM50132628
Substrate/Competitorn/a
Meas. Tech.ChEMBL_212913 (CHEMBL873902)
IC50 6±n/a nM
Citation Letavic, MABarberia, JTCarty, TJHardink, JRLiras, JLopresti-Morrow, LLMitchell, PGNoe, MCReeves, LMSnow, SLStam, EJSweeney, FJVaughn, MLYu, CH Synthesis and biological activity of piperazine-based dual MMP-13 and TNF-alpha converting enzyme inhibitors. Bioorg Med Chem Lett13:3243-6 (2003) Disintegrin and metalloproteinase domain-containing protein 17
Name:Disintegrin and metalloproteinase domain-containing protein 17
Type:Enzyme
Mol. Mass.:93007.89
Organism:Homo sapiens (Human)
Description:
Residue:824
BDBM50132628
NameBDBM50132628
Synonyms:(2R,3S)-4-Methanesulfonyl-3-methyl-1-[4-(2-methyl-benzyloxy)-benzenesulfonyl]-piperazine-2-carboxylic acid hydroxyamide | CHEMBL110901
TypeSmall organic molecule
Emp. Form.C21H27N3O7S2
Mol. Mass.497.585
SMILESC[C@H]1[C@@H](N(CCN1S(C)(=O)=O)S(=O)(=O)c1ccc(OCc2ccccc2C)cc1)C(=O)NO