Reaction Details
TargetCollagenase 3
LigandBDBM50132625
Substrate/Competitorn/a
Meas. Tech.ChEBML_106625
IC50 4±n/a nM
Citation Letavic, MABarberia, JTCarty, TJHardink, JRLiras, JLopresti-Morrow, LLMitchell, PGNoe, MCReeves, LMSnow, SLStam, EJSweeney, FJVaughn, MLYu, CH Synthesis and biological activity of piperazine-based dual MMP-13 and TNF-alpha converting enzyme inhibitors. Bioorg Med Chem Lett13:3243-6 (2003) Collagenase 3
Name:Collagenase 3
Type:Enzyme
Mol. Mass.:53808.06
Organism:Homo sapiens (Human)
Description:P45452
Residue:471
BDBM50132625
NameBDBM50132625
Synonyms:(2S,3R)-3-Hydroxycarbamoyl-2-methyl-4-[4-(2-methyl-benzyloxy)-benzenesulfonyl]-piperazine-1-carboxylic acid methyl ester | CHEMBL326221
TypeSmall organic molecule
Emp. Form.C22H27N3O7S
Mol. Mass.477.531
SMILESCOC(=O)N1CCN([C@H]([C@@H]1C)C(=O)NO)S(=O)(=O)c1ccc(OCc2ccccc2C)cc1