Reaction Details
TargetNociceptin receptor
LigandBDBM50132648
Substrate/Competitorn/a
Meas. Tech.ChEMBL_148271 (CHEMBL750188)
Ki 502.0±n/a nM
Citation Chen, ZMiller, WSShan, SValenzano, KJ Design and parallel synthesis of piperidine libraries targeting the nociceptin (N/OFQ) receptor. Bioorg Med Chem Lett13:3247-52 (2003) Nociceptin receptor
Name:Nociceptin receptor
Type:G Protein-Coupled Receptor (GPCR)
Mol. Mass.:40702.87
Organism:Homo sapiens (Human)
Description:P41146
Residue:370
BDBM50132648
NameBDBM50132648
Synonyms:4-(4-Chloro-phenyl)-1-cyclooctylmethyl-piperidin-4-ol | CHEMBL320991
TypeSmall organic molecule
Emp. Form.C20H30ClNO
Mol. Mass.335.911
SMILESOC1(CCN(CC2CCCCCCC2)CC1)c1ccc(Cl)cc1