Reaction Details
TargetMu-type opioid receptor
LigandBDBM50132645
Substrate/Competitorn/a
Meas. Tech.ChEBML_149491
Ki 8±n/a nM
Citation Chen, ZMiller, WSShan, SValenzano, KJ Design and parallel synthesis of piperidine libraries targeting the nociceptin (N/OFQ) receptor. Bioorg Med Chem Lett13:3247-52 (2003) Mu-type opioid receptor
Name:Mu-type opioid receptor
Type:G Protein-Coupled Receptor (GPCR)
Mol. Mass.:44789.51
Organism:Homo sapiens (Human)
Description:P35372
Residue:400
BDBM50132645
NameBDBM50132645
Synonyms:4-(4-Chloro-3-trifluoromethyl-phenyl)-1-(4-isopropyl-cyclohexyl)-piperidin-4-ol | CHEMBL111230
TypeSmall organic molecule
Emp. Form.C21H29ClF3NO
Mol. Mass.403.909
SMILESCC(C)C1CCC(CC1)N1CCC(O)(CC1)c1ccc(Cl)c(c1)C(F)(F)F