Reaction Details
TargetNociceptin receptor
LigandBDBM50132656
Substrate/Competitorn/a
Meas. Tech.ChEBML_148272
Ki 1106±n/a nM
Citation Chen, ZMiller, WSShan, SValenzano, KJ Design and parallel synthesis of piperidine libraries targeting the nociceptin (N/OFQ) receptor. Bioorg Med Chem Lett13:3247-52 (2003) Nociceptin receptor
Name:Nociceptin receptor
Type:G Protein-Coupled Receptor (GPCR)
Mol. Mass.:40702.87
Organism:Homo sapiens (Human)
Description:P41146
Residue:370
BDBM50132656
NameBDBM50132656
Synonyms:1-Naphthalen-2-ylmethyl-4-phenyl-piperidine-4-carbonitrile | CHEMBL320058
TypeSmall organic molecule
Emp. Form.C23H22N2
Mol. Mass.326.4342
SMILESN#CC1(CCN(Cc2ccc3ccccc3c2)CC1)c1ccccc1