Reaction Details
TargetKappa-type opioid receptor
LigandBDBM50132652
Substrate/Competitorn/a
Meas. Tech.ChEBML_145236
Ki 4240.0±n/a nM
Citation Chen, ZMiller, WSShan, SValenzano, KJ Design and parallel synthesis of piperidine libraries targeting the nociceptin (N/OFQ) receptor. Bioorg Med Chem Lett13:3247-52 (2003) Kappa-type opioid receptor
Name:Kappa-type opioid receptor
Type:G Protein-Coupled Receptor (GPCR)
Mol. Mass.:42648.76
Organism:Homo sapiens (Human)
Description:P41145
Residue:380
BDBM50132652
NameBDBM50132652
Synonyms:1-Cyclooctylmethyl-4-(3-trifluoromethyl-phenyl)-piperidin-4-ol | CHEMBL113684
TypeSmall organic molecule
Emp. Form.C21H30F3NO
Mol. Mass.369.4642
SMILESOC1(CCN(CC2CCCCCCC2)CC1)c1cccc(c1)C(F)(F)F