Reaction Details
TargetNociceptin receptor
LigandBDBM50132659
Substrate/Competitorn/a
Meas. Tech.ChEBML_148272
Ki 1270±n/a nM
Citation Chen, ZMiller, WSShan, SValenzano, KJ Design and parallel synthesis of piperidine libraries targeting the nociceptin (N/OFQ) receptor. Bioorg Med Chem Lett13:3247-52 (2003) Nociceptin receptor
Name:Nociceptin receptor
Type:G Protein-Coupled Receptor (GPCR)
Mol. Mass.:40702.87
Organism:Homo sapiens (Human)
Description:P41146
Residue:370
BDBM50132659
NameBDBM50132659
Synonyms:1-(3,4-Dichloro-benzyl)-4-phenyl-piperidine-4-carbonitrile | CHEMBL111628
TypeSmall organic molecule
Emp. Form.C19H18Cl2N2
Mol. Mass.345.266
SMILESClc1ccc(CN2CCC(CC2)(C#N)c2ccccc2)cc1Cl