Reaction Details
TargetNociceptin receptor
LigandBDBM50132662
Substrate/Competitorn/a
Meas. Tech.ChEBML_148272
Ki 879±n/a nM
Citation Chen, ZMiller, WSShan, SValenzano, KJ Design and parallel synthesis of piperidine libraries targeting the nociceptin (N/OFQ) receptor. Bioorg Med Chem Lett13:3247-52 (2003) Nociceptin receptor
Name:Nociceptin receptor
Type:G Protein-Coupled Receptor (GPCR)
Mol. Mass.:40702.87
Organism:Homo sapiens (Human)
Description:P41146
Residue:370
BDBM50132662
NameBDBM50132662
Synonyms:4-(4-Chloro-3-trifluoromethyl-phenyl)-1-naphthalen-2-ylmethyl-piperidin-4-ol | CHEMBL111233
TypeSmall organic molecule
Emp. Form.C23H21ClF3NO
Mol. Mass.419.867
SMILESOC1(CCN(Cc2ccc3ccccc3c2)CC1)c1ccc(Cl)c(c1)C(F)(F)F