Reaction Details
TargetMu-type opioid receptor
LigandBDBM50132650
Substrate/Competitorn/a
Meas. Tech.ChEBML_149491
Ki 21±n/a nM
Citation Chen, ZMiller, WSShan, SValenzano, KJ Design and parallel synthesis of piperidine libraries targeting the nociceptin (N/OFQ) receptor. Bioorg Med Chem Lett13:3247-52 (2003) Mu-type opioid receptor
Name:Mu-type opioid receptor
Type:G Protein-Coupled Receptor (GPCR)
Mol. Mass.:44789.51
Organism:Homo sapiens (Human)
Description:P35372
Residue:400
BDBM50132650
NameBDBM50132650
Synonyms:1-(Decahydro-naphthalen-2-yl)-4-(3-trifluoromethyl-phenyl)-piperidin-4-ol | CHEMBL111347
TypeSmall organic molecule
Emp. Form.C22H30F3NO
Mol. Mass.381.4749
SMILESOC1(CCN(CC1)C1CCC2CCCCC2C1)c1cccc(c1)C(F)(F)F