Reaction Details
TargetNociceptin receptor
LigandBDBM50132664
Substrate/Competitorn/a
Meas. Tech.ChEBML_148272
Ki 715±n/a nM
Citation Chen, ZMiller, WSShan, SValenzano, KJ Design and parallel synthesis of piperidine libraries targeting the nociceptin (N/OFQ) receptor. Bioorg Med Chem Lett13:3247-52 (2003) Nociceptin receptor
Name:Nociceptin receptor
Type:G Protein-Coupled Receptor (GPCR)
Mol. Mass.:40702.87
Organism:Homo sapiens (Human)
Description:P41146
Residue:370
BDBM50132664
NameBDBM50132664
Synonyms:1-Naphthalen-2-ylmethyl-4-(3-trifluoromethyl-phenyl)-piperidin-4-ol | CHEMBL323729
TypeSmall organic molecule
Emp. Form.C23H22F3NO
Mol. Mass.385.4221
SMILESOC1(CCN(Cc2ccc3ccccc3c2)CC1)c1cccc(c1)C(F)(F)F