Reaction Details
TargetPeptide deformylase, mitochondrial
LigandBDBM50089194
Substrate/Competitorn/a
Meas. Tech.ChEMBL_154318 (CHEMBL762803)
Ki 0.300000±n/a nM
Citation Takayama, WShirasaki, YSakai, YNakajima, EFujita, SSakamoto-Mizutani, KInoue, J Synthesis and PDF inhibitory activities of novel benzothiazolylidenehydroxamic acid derivatives. Bioorg Med Chem Lett13:3273-6 (2003) Peptide deformylase, mitochondrial
Name:Peptide deformylase, mitochondrial
Type:PROTEIN
Mol. Mass.:27023.25
Organism:Homo sapiens (Human)
Description:ChEMBL_154318
Residue:243
BDBM50089194
NameBDBM50089194
Synonyms:(R)-N*4*-Hydroxy-N*1*-[(S)-1-((S)-2-hydroxymethyl-pyrrolidine-1-carbonyl)-2-methyl-propyl]-2-pentyl-succinamide ACTINONIN N*4*-Hydroxy-N*1*-[(S)-1-((S)-2-hydroxymethyl-pyrrolidine-1-carbonyl)-2-methyl-propyl]-2-(R)-pentyl-succinamide | N*4*-Hydroxy-N*1*-[1-(2-hydroxymethyl-pyrrolidine-1-carbonyl)-2-methyl-propyl]-2-pentyl-succinamide
TypeSmall organic molecule
Emp. Form.C19H35N3O5
Mol. Mass.385.4983
SMILESCCCCC[C@H](CC(=O)NO)C(=O)N[C@@H](C(C)C)C(=O)N1CCC[C@H]1CO