Reaction Details
TargetPeptide deformylase, mitochondrial
LigandBDBM50132672
Substrate/Competitorn/a
Meas. Tech.ChEBML_154318
IC50 8390.0±n/a nM
Citation Takayama, WShirasaki, YSakai, YNakajima, EFujita, SSakamoto-Mizutani, KInoue, J Synthesis and PDF inhibitory activities of novel benzothiazolylidenehydroxamic acid derivatives. Bioorg Med Chem Lett13:3273-6 (2003) Peptide deformylase, mitochondrial
Name:Peptide deformylase, mitochondrial
Type:PROTEIN
Mol. Mass.:27023.25
Organism:Homo sapiens (Human)
Description:ChEMBL_154318
Residue:243
BDBM50132672
NameBDBM50132672
Synonyms:CHEMBL419929 | N-Hydroxy-2-[3-propyl-3H-benzothiazol-(2Z)-ylidene]-acetamide
TypeSmall organic molecule
Emp. Form.C12H14N2O2S
Mol. Mass.250.317
SMILESCCCN1\C(Sc2ccccc12)=C\C(=O)NO