Reaction Details
TargetPeptide deformylase, mitochondrial
LigandBDBM50132675
Substrate/Competitorn/a
Meas. Tech.ChEBML_154318
IC50 9910±n/a nM
Citation Takayama, WShirasaki, YSakai, YNakajima, EFujita, SSakamoto-Mizutani, KInoue, J Synthesis and PDF inhibitory activities of novel benzothiazolylidenehydroxamic acid derivatives. Bioorg Med Chem Lett13:3273-6 (2003) Peptide deformylase, mitochondrial
Name:Peptide deformylase, mitochondrial
Type:PROTEIN
Mol. Mass.:27023.25
Organism:Homo sapiens (Human)
Description:ChEMBL_154318
Residue:243
BDBM50132675
NameBDBM50132675
Synonyms:CHEMBL331367 | N-Hydroxy-2-[3-pentyl-3H-benzothiazol-(2Z)-ylidene]-acetamide
TypeSmall organic molecule
Emp. Form.C14H18N2O2S
Mol. Mass.278.37
SMILESCCCCCN1\C(Sc2ccccc12)=C\C(=O)NO