Reaction Details
Target5-hydroxytryptamine receptor 6
LigandBDBM50130275
Substrate/Competitorn/a
Meas. Tech.ChEBML_3617
Ki 0.800000±n/a nM
Citation Pullagurla, MRDukat, MSetola, VRoth, BGlennon, RA N1-benzenesulfonylgramine and N1-benzenesulfonylskatole: novel 5-HT6 receptor ligand templates. Bioorg Med Chem Lett13:3355-9 (2003) 5-hydroxytryptamine receptor 6
Name:5-hydroxytryptamine receptor 6
Type:G Protein-Coupled Receptor (GPCR)
Mol. Mass.:46968.43
Organism:Homo sapiens (Human)
Description:P50406
Residue:440
BDBM50130275
NameBDBM50130275
Synonyms:4-(3-(2-(dimethylamino)ethyl)-1H-indol-1-ylsulfonyl)benzenamine 4-{3-[2-(dimethylamino)ethyl]-1H-indole-1-sulfonyl}aniline, 7 | CHEMBL94093
TypeSmall organic molecule
Emp. Form.C18H21N3O2S
Mol. Mass.343.443
SMILESCN(C)CCc1cn(c2ccccc12)S(=O)(=O)c1ccc(N)cc1