Reaction Details
TargetPlasminogen activator inhibitor 1
LigandBDBM50132853
Substrate/Competitorn/a
Meas. Tech.ChEBML_155612
IC50 400±n/a nM
Citation Ye, BBauer, SBuckman, BOGhannam, AGriedel, BDKhim, SKLee, WSacchi, KLShaw, KJLiang, AWu, QZhao, Z Synthesis and biological evaluation of menthol-based derivatives as inhibitors of plasminogen activator inhibitor-1 (PAI-1). Bioorg Med Chem Lett13:3361-5 (2003) Plasminogen activator inhibitor 1
Name:Plasminogen activator inhibitor 1
Type:Enzyme
Mol. Mass.:45064.00
Organism:Homo sapiens (Human)
Description:P05121
Residue:402
BDBM50132853
NameBDBM50132853
Synonyms:3-{3-[2-((1R,2S,5R)-2-Isopropyl-5-methyl-cyclohexyloxy)-acetylamino]-4-nitro-phenoxy}-benzoic acid | CHEMBL114144
TypeSmall organic molecule
Emp. Form.C25H30N2O7
Mol. Mass.470.5149
SMILESCC(C)[C@@H]1CC[C@@H](C)C[C@H]1OCC(=O)Nc1cc(Oc2cccc(c2)C(O)=O)ccc1[N+]([O-])=O