Reaction Details
TargetPlasminogen activator inhibitor 1
LigandBDBM50132874
Substrate/Competitorn/a
Meas. Tech.ChEBML_155612
IC50 530±n/a nM
Citation Ye, BBauer, SBuckman, BOGhannam, AGriedel, BDKhim, SKLee, WSacchi, KLShaw, KJLiang, AWu, QZhao, Z Synthesis and biological evaluation of menthol-based derivatives as inhibitors of plasminogen activator inhibitor-1 (PAI-1). Bioorg Med Chem Lett13:3361-5 (2003) Plasminogen activator inhibitor 1
Name:Plasminogen activator inhibitor 1
Type:Enzyme
Mol. Mass.:45064.00
Organism:Homo sapiens (Human)
Description:P05121
Residue:402
BDBM50132874
NameBDBM50132874
Synonyms:3-Hydroxy-4-({6-[2-((1R,2S,5R)-2-isopropyl-5-methyl-cyclohexyloxy)-acetylamino]-pyridin-3-ylamino}-methyl)-8-methoxy-1,9-dimethyl-11-oxo-11H-dibenzo[b,e][1,4]dioxepine-6-carboxylic acid | CHEMBL113249
TypeSmall organic molecule
Emp. Form.C35H41N3O9
Mol. Mass.647.7147
SMILESCOc1cc(C(O)=O)c2Oc3c(CNc4ccc(NC(=O)CO[C@@H]5C[C@H](C)CC[C@H]5C(C)C)nc4)c(O)cc(C)c3C(=O)Oc2c1C