Reaction Details
TargetCorticotropin-releasing factor receptor 1
LigandBDBM50132953
Substrate/Competitorn/a
Meas. Tech.ChEBML_51117
Ki 3.8±n/a nM
Citation Huang, CQWilcoxen, KMcCarthy, JRHaddach, MWebb, TRGu, JXie, YFGrigoriadis, DEChen, C Synthesis and SAR of 8-arylquinolines as potent corticotropin-releasing factor1 (CRF1) receptor antagonists. Bioorg Med Chem Lett13:3375-9 (2003) Corticotropin-releasing factor receptor 1
Name:Corticotropin-releasing factor receptor 1
Type:Enzyme
Mol. Mass.:50744.31
Organism:Homo sapiens (Human)
Description:P34998
Residue:444
BDBM50132953
NameBDBM50132953
Synonyms:Benzyl-[8-(2,4-dichloro-phenyl)-2-methyl-quinolin-4-yl]-propyl-amine | CHEMBL115030
TypeSmall organic molecule
Emp. Form.C26H24Cl2N2
Mol. Mass.435.388
SMILESCCCN(Cc1ccccc1)c1cc(C)nc2c(cccc12)-c1ccc(Cl)cc1Cl