Reaction Details
TargetCorticotropin-releasing factor receptor 1
LigandBDBM50132972
Substrate/Competitorn/a
Meas. Tech.ChEBML_51117
Ki 6.5±n/a nM
Citation Huang, CQWilcoxen, KMcCarthy, JRHaddach, MWebb, TRGu, JXie, YFGrigoriadis, DEChen, C Synthesis and SAR of 8-arylquinolines as potent corticotropin-releasing factor1 (CRF1) receptor antagonists. Bioorg Med Chem Lett13:3375-9 (2003) Corticotropin-releasing factor receptor 1
Name:Corticotropin-releasing factor receptor 1
Type:Enzyme
Mol. Mass.:50744.31
Organism:Homo sapiens (Human)
Description:P34998
Residue:444
BDBM50132972
NameBDBM50132972
Synonyms:Bis-(2-methoxy-ethyl)-[2-methyl-8-(2,4,6-trimethyl-phenyl)-quinolin-4-yl]-amine | CHEMBL115032
TypeSmall organic molecule
Emp. Form.C25H32N2O2
Mol. Mass.392.5338
SMILESCOCCN(CCOC)c1cc(C)nc2c(cccc12)-c1c(C)cc(C)cc1C