Reaction Details
TargetTGF-beta receptor type-1
LigandBDBM50132988
Substrate/Competitorn/a
Meas. Tech.ChEMBL_129905 (CHEMBL740149)
IC50 1.2±n/a nM
Citation Sawyer, JSAnderson, BDBeight, DWCampbell, RMJones, MLHerron, DKLampe, JWMcCowan, JRMcMillen, WTMort, NParsons, SSmith, ECVieth, MWeir, LCYan, LZhang, FYingling, JM Synthesis and activity of new aryl- and heteroaryl-substituted pyrazole inhibitors of the transforming growth factor-beta type I receptor kinase domain. J Med Chem46:3953-6 (2003) 
 
TGF-beta receptor type-1
Name:TGF-beta receptor type-1
Type:enzyme
Mol. Mass.:55968.24
Organism:Homo sapiens (Human)
Description:P36897
Residue:503
BDBM50132988
NameBDBM50132988
Synonyms:4-[3-(6-Bromo-pyridin-2-yl)-1H-pyrazol-4-yl]-quinoline | CHEMBL341280
TypeSmall organic molecule
Emp. Form.C17H11BrN4
Mol. Mass.351.2
SMILESBrc1cccc(n1)-c1n[nH]cc1-c1ccnc2ccccc12