Reaction Details
TargetTGF-beta receptor type-1
LigandBDBM50132989
Substrate/Competitorn/a
Meas. Tech.ChEMBL_123678 (CHEMBL728561)
IC50 2.9±n/a nM
Citation Sawyer, JSAnderson, BDBeight, DWCampbell, RMJones, MLHerron, DKLampe, JWMcCowan, JRMcMillen, WTMort, NParsons, SSmith, ECVieth, MWeir, LCYan, LZhang, FYingling, JM Synthesis and activity of new aryl- and heteroaryl-substituted pyrazole inhibitors of the transforming growth factor-beta type I receptor kinase domain. J Med Chem46:3953-6 (2003) 
 
TGF-beta receptor type-1
Name:TGF-beta receptor type-1
Type:enzyme
Mol. Mass.:55968.24
Organism:Homo sapiens (Human)
Description:P36897
Residue:503
BDBM50132989
NameBDBM50132989
Synonyms:4-[3-(6-Methyl-pyridin-2-yl)-1H-pyrazol-4-yl]-quinoline | CHEMBL129677
TypeSmall organic molecule
Emp. Form.C18H14N4
Mol. Mass.286.3306
SMILESCc1cccc(n1)-c1n[nH]cc1-c1ccnc2ccccc12