Reaction Details
TargetKappa-type opioid receptor
LigandBDBM50133056
Substrate/Competitorn/a
Meas. Tech.ChEMBL_145817 (CHEMBL873914)
Ki 9.54±n/a nM
Citation Vig, BSZheng, MQMurray, TFAldrich, JV Effects of the substitution of Phe4 in the opioid peptide [D-Ala8]dynorphin A-(1-11)NH2. J Med Chem46:4002-8 (2003) 
 
Kappa-type opioid receptor
Name:Kappa-type opioid receptor
Type:G Protein-Coupled Receptor (GPCR)
Mol. Mass.:42692.90
Organism:Rattus norvegicus (rat)
Description:P34975
Residue:380
BDBM50133056
NameBDBM50133056
Synonyms:CHEMBL262838 | Opioid Peptide [d-Ala(8)]Dynorphin derivative
TypeSmall organic molecule
Emp. Form.C62H100N22O12
Mol. Mass.1345.5976
SMILESCC(C)C[C@H](NC(=O)[C@@]1(CCc2ccccc2C1)NC(=O)CNC(=O)CNC(=O)[C@@H](N)Cc1ccc(O)cc1)C(=O)N[C@@H](CCCNC(N)=N)C(=O)N[C@@H](CCCNC(N)=N)C(=O)N[C@H](C)C(=O)N[C@@H](CCCNC(N)=N)C(=O)N1CCC[C@H]1C(=O)N[C@@H](CCCCN)C(N)=O