Reaction Details
TargetMu-type opioid receptor
LigandBDBM50079413
Substrate/Competitorn/a
Meas. Tech.ChEMBL_148870 (CHEMBL753748)
Ki 123±n/a nM
Citation Vig, BSZheng, MQMurray, TFAldrich, JV Effects of the substitution of Phe4 in the opioid peptide [D-Ala8]dynorphin A-(1-11)NH2. J Med Chem46:4002-8 (2003) 
 
Mu-type opioid receptor
Name:Mu-type opioid receptor
Type:G Protein-Coupled Receptor (GPCR)
Mol. Mass.:44503.11
Organism:Rattus norvegicus (rat)
Description:Competition binding assays were carried out using membrane preparations from transfected HN9.10 cells that constitutively expressed the mu opioid receptor.
Residue:398
BDBM50079413
NameBDBM50079413
Synonyms:CHEMBL407084 Tyr-Gly-Gly-Phe-Leu-Arg-Arg-D-Ala-Arg-Pro-Lys-NH2
TypeSmall organic molecule
Emp. Form.C60H98N22O12
Mol. Mass.1319.5603
SMILESCC(C)C[C@H](NC(=O)[C@H](Cc1ccccc1)NC(=O)CNC(=O)CNC(=O)[C@@H](N)Cc1ccc(O)cc1)C(=O)N[C@@H](CCCN=C(N)N)C(=O)N[C@@H](CCCN=C(N)N)C(=O)N[C@H](C)C(=O)N[C@@H](CCCN=C(N)N)C(=O)N1CCC[C@H]1C(=O)N[C@@H](CCCCN)C(N)=O