Reaction Details
TargetEstrogen receptor
LigandBDBM50133070
Substrate/Competitorn/a
Meas. Tech.ChEMBL_67038 (CHEMBL677876)
Ki 0.15±n/a nM
Citation Minutolo, FAntonello, MBertini, SOrtore, GPlacanica, GRapposelli, SSheng, SCarlson, KEKatzenellenbogen, BSKatzenellenbogen, JAMacchia, M Novel estrogen receptor ligands based on an anthranylaldoxime structure: role of the phenol-type pseudocycle in the binding process. J Med Chem46:4032-42 (2003) 
 
Estrogen receptor
Name:Estrogen receptor
Type:Protein
Mol. Mass.:66230.44
Organism:Homo sapiens (Human)
Description:P03372
Residue:595
BDBM50133070
NameBDBM50133070
Synonyms:CHEMBL335465 | [1,1';2',1'']Terphenyl-4'-carbaldehyde oxime
TypeSmall organic molecule
Emp. Form.C19H15NO
Mol. Mass.273.3285
SMILESO=NCc1ccc(-c2ccccc2)c(c1)-c1ccccc1