Reaction Details
TargetC-C chemokine receptor type 2
LigandBDBM50088301
Substrate/Competitorn/a
Meas. Tech.ChEMBL_41892 (CHEMBL655685)
IC50 27±n/a nM
Citation Berkhout, TABlaney, FEBridges, AMCooper, DGForbes, ITGribble, ADGroot, PHHardy, AIfe, RJKaur, RMoores, KEShillito, HWilletts, JWitherington, J CCR2: characterization of the antagonist binding site from a combined receptor modeling/mutagenesis approach. J Med Chem46:4070-86 (2003) 
 
C-C chemokine receptor type 2
Name:C-C chemokine receptor type 2
Type:Enzyme
Mol. Mass.:41932.32
Organism:Homo sapiens (Human)
Description:P41597
Residue:374
BDBM50088301
NameBDBM50088301
Synonyms:(E)-N,N-dimethyl-N-(4-(2-p-tolyl-6,7-dihydro-5H-benzo[7]annulene-8-carboxamido)benzyl)tetrahydro-2H-pyran-4-aminium chloride CHEMBL41275 Dimethyl-(tetrahydro-pyran-4-yl)-{4-[(3-p-tolyl-8,9-dihydro-7H-benzocycloheptene-6-carbonyl)-amino]-benzyl}-ammonium; chloride N-(4-(2-p-tolyl-6,7-dihydro-5H-benzo[7]annulene-8-carboxamido)benzyl)-N,N-dimethyl-tetrahydro-2H-pyran-4-aminium chloride | TAK-779
TypeSmall organic molecule
Emp. Form.C33H39N2O2
Mol. Mass.495.6744
SMILESCc1ccc(cc1)-c1ccc2CCCC(=Cc2c1)C(=O)Nc1ccc(C[N+](C)(C)C2CCOCC2)cc1