Reaction Details
TargetRetinoic acid receptor RXR-alpha
LigandBDBM50129720
Substrate/Competitorn/a
Meas. Tech.ChEMBL_196897 (CHEMBL807181)
Ki 3±n/a nM
Citation Michellys, PYArdecky, RJChen, JHD'Arrigo, JGrese, TAKaranewsky, DSLeibowitz, MDLiu, SMais, DAMapes, CMMontrose-Rafizadeh, COgilvie, KMReifel-Miller, ARungta, DThompson, AWTyhonas, JSBoehm, MF Design, synthesis, and structure-activity relationship studies of novel 6,7-locked-[7-(2-alkoxy-3,5-dialkylbenzene)-3-methylocta]-2,4,6-trienoic acids. J Med Chem46:4087-103 (2003) 
 
Retinoic acid receptor RXR-alpha
Name:Retinoic acid receptor RXR-alpha
Type:Enzyme Catalytic Domain
Mol. Mass.:51273.78
Organism:RAT
Description:NR2B Channel Blocker 0 RAT::Q05343
Residue:467
BDBM50129720
NameBDBM50129720
Synonyms:(2E,4E,6Z)-7-[3,5-Di-tert-butyl-2-(2,2-difluoro-ethoxy)-phenyl]-3-methyl-octa-2,4,6-trienoic acid CHEMBL42314
TypeSmall organic molecule
Emp. Form.C25H34F2O3
Mol. Mass.420.5325
SMILESC\C(\C=C\C=C(\C)c1cc(cc(c1OCC(F)F)C(C)(C)C)C(C)(C)C)=C/C(O)=O