Reaction Details
TargetRetinoic acid receptor RXR-beta
LigandBDBM50133117
Substrate/Competitorn/a
Meas. Tech.ChEMBL_197072 (CHEMBL872603)
Ki 7.2±n/a nM
Citation Michellys, PYArdecky, RJChen, JHD'Arrigo, JGrese, TAKaranewsky, DSLeibowitz, MDLiu, SMais, DAMapes, CMMontrose-Rafizadeh, COgilvie, KMReifel-Miller, ARungta, DThompson, AWTyhonas, JSBoehm, MF Design, synthesis, and structure-activity relationship studies of novel 6,7-locked-[7-(2-alkoxy-3,5-dialkylbenzene)-3-methylocta]-2,4,6-trienoic acids. J Med Chem46:4087-103 (2003) 
 
Retinoic acid receptor RXR-beta
Name:Retinoic acid receptor RXR-beta
Type:PROTEIN
Mol. Mass.:49084.47
Organism:Rattus norvegicus
Description:ChEMBL_197072
Residue:458
BDBM50133117
NameBDBM50133117
Synonyms:5-{2-[2-(3-Fluoro-propoxy)-3,5-diisopropyl-phenyl]-furan-3-yl}-3-methyl-penta-2,4-dienoic acid | CHEMBL335751
TypeSmall organic molecule
Emp. Form.C25H31FO4
Mol. Mass.414.5096
SMILESCC(C)c1cc(C(C)C)c(OCCCF)c(c1)-c1occc1\C=C\C(\C)=C\C(O)=O