Reaction Details
TargetPeroxisome proliferator-activated receptor gamma
LigandBDBM50133123
Substrate/Competitorn/a
Meas. Tech.ChEMBL_154539 (CHEMBL760259)
Ki 1750±n/a nM
Citation Michellys, PYArdecky, RJChen, JHD'Arrigo, JGrese, TAKaranewsky, DSLeibowitz, MDLiu, SMais, DAMapes, CMMontrose-Rafizadeh, COgilvie, KMReifel-Miller, ARungta, DThompson, AWTyhonas, JSBoehm, MF Design, synthesis, and structure-activity relationship studies of novel 6,7-locked-[7-(2-alkoxy-3,5-dialkylbenzene)-3-methylocta]-2,4,6-trienoic acids. J Med Chem46:4087-103 (2003) 
 
Peroxisome proliferator-activated receptor gamma
Name:Peroxisome proliferator-activated receptor gamma
Type:PROTEIN
Mol. Mass.:57562.54
Organism:Rattus norvegicus
Description:ChEMBL_642067
Residue:505
BDBM50133123
NameBDBM50133123
Synonyms:5-{3-[3-tert-Butyl-5-ethyl-2-(3-fluoro-propoxy)-phenyl]-thiophen-2-yl}-3-methyl-penta-2,4-dienoic acid | CHEMBL339298
TypeSmall organic molecule
Emp. Form.C25H31FO3S
Mol. Mass.430.575
SMILESCCc1cc(-c2ccsc2\C=C\C(\C)=C\C(O)=O)c(OCCCF)c(c1)C(C)(C)C