Reaction Details
TargetRetinoic acid receptor RXR-gamma
LigandBDBM50133118
Substrate/Competitorn/a
Meas. Tech.ChEMBL_197230 (CHEMBL801376)
Ki 2.5±n/a nM
Citation Michellys, PYArdecky, RJChen, JHD'Arrigo, JGrese, TAKaranewsky, DSLeibowitz, MDLiu, SMais, DAMapes, CMMontrose-Rafizadeh, COgilvie, KMReifel-Miller, ARungta, DThompson, AWTyhonas, JSBoehm, MF Design, synthesis, and structure-activity relationship studies of novel 6,7-locked-[7-(2-alkoxy-3,5-dialkylbenzene)-3-methylocta]-2,4,6-trienoic acids. J Med Chem46:4087-103 (2003) 
 
Retinoic acid receptor RXR-gamma
Name:Retinoic acid receptor RXR-gamma
Type:PROTEIN
Mol. Mass.:50901.38
Organism:Rattus norvegicus
Description:ChEMBL_197230
Residue:463
BDBM50133118
NameBDBM50133118
Synonyms:5-{3-[2-(2,2-Difluoro-ethoxy)-3,5-diisopropyl-phenyl]-thiophen-2-yl}-3-methyl-penta-2,4-dienoic acid | CHEMBL340555
TypeSmall organic molecule
Emp. Form.C24H28F2O3S
Mol. Mass.434.539
SMILESCC(C)c1cc(C(C)C)c(OCC(F)F)c(c1)-c1ccsc1\C=C\C(\C)=C\C(O)=O