Reaction Details
TargetRetinoic acid receptor RXR-beta
LigandBDBM50133128
Substrate/Competitorn/a
Meas. Tech.ChEMBL_197072 (CHEMBL872603)
Ki 2.5±n/a nM
Citation Michellys, PYArdecky, RJChen, JHD'Arrigo, JGrese, TAKaranewsky, DSLeibowitz, MDLiu, SMais, DAMapes, CMMontrose-Rafizadeh, COgilvie, KMReifel-Miller, ARungta, DThompson, AWTyhonas, JSBoehm, MF Design, synthesis, and structure-activity relationship studies of novel 6,7-locked-[7-(2-alkoxy-3,5-dialkylbenzene)-3-methylocta]-2,4,6-trienoic acids. J Med Chem46:4087-103 (2003) 
 
Retinoic acid receptor RXR-beta
Name:Retinoic acid receptor RXR-beta
Type:PROTEIN
Mol. Mass.:49084.47
Organism:Rattus norvegicus
Description:ChEMBL_197072
Residue:458
BDBM50133128
NameBDBM50133128
Synonyms:5-{2-[2-(2,2-Difluoro-ethoxy)-3,5-diisopropyl-phenyl]-cyclopent-1-enyl}-3-methyl-penta-2,4-dienoic acid | CHEMBL340074
TypeSmall organic molecule
Emp. Form.C25H32F2O3
Mol. Mass.418.5166
SMILESCC(C)c1cc(C(C)C)c(OCC(F)F)c(c1)C1=C(CCC1)\C=C\C(\C)=C\C(O)=O