Reaction Details
TargetProgesterone receptor
LigandBDBM50133144
Substrate/Competitorn/a
Meas. Tech.ChEMBL_159730 (CHEMBL766187)
Ki 3.8±n/a nM
Citation Zhi, LTegley, CMPio, BEdwards, JPMotamedi, MJones, TKMarschke, KBMais, DERisek, BSchrader, WT 5-benzylidene-1,2-dihydrochromeno[3,4-f]quinolines as selective progesterone receptor modulators. J Med Chem46:4104-12 (2003) 
 
Progesterone receptor
Name:Progesterone receptor
Type:Protein
Mol. Mass.:98979.52
Organism:Homo sapiens (Human)
Description:P06401
Residue:933
BDBM50133144
NameBDBM50133144
Synonyms:9-Fluoro-5-[1-(2-methoxy-phenyl)-meth-(Z)-ylidene]-2,2,4-trimethyl-2,5-dihydro-1H-6-oxa-1-aza-chrysene | CHEMBL335996
TypeSmall organic molecule
Emp. Form.C27H24FNO2
Mol. Mass.413.4834
SMILESCOc1ccccc1\C=C1/Oc2ccc(F)cc2-c2ccc3NC(C)(C)C=C(C)c3c12