Reaction Details
TargetProgesterone receptor
LigandBDBM50133137
Substrate/Competitorn/a
Meas. Tech.ChEMBL_159730 (CHEMBL766187)
Ki 6.4±n/a nM
Citation Zhi, LTegley, CMPio, BEdwards, JPMotamedi, MJones, TKMarschke, KBMais, DERisek, BSchrader, WT 5-benzylidene-1,2-dihydrochromeno[3,4-f]quinolines as selective progesterone receptor modulators. J Med Chem46:4104-12 (2003) 
 
Progesterone receptor
Name:Progesterone receptor
Type:Protein
Mol. Mass.:98979.52
Organism:Homo sapiens (Human)
Description:P06401
Residue:933
BDBM50133137
NameBDBM50133137
Synonyms:9-Fluoro-2,2,4-trimethyl-5-[1-(2-trifluoromethoxy-phenyl)-meth-(Z)-ylidene]-2,5-dihydro-1H-6-oxa-1-aza-chrysene | CHEMBL132578
TypeSmall organic molecule
Emp. Form.C27H21F4NO2
Mol. Mass.467.4548
SMILESCC1=CC(C)(C)Nc2ccc3-c4cc(F)ccc4O\C(=C/c4ccccc4OC(F)(F)F)c3c12