Reaction Details
TargetProgesterone receptor
LigandBDBM50133139
Substrate/Competitorn/a
Meas. Tech.ChEMBL_159730 (CHEMBL766187)
Ki 0.62±n/a nM
Citation Zhi, LTegley, CMPio, BEdwards, JPMotamedi, MJones, TKMarschke, KBMais, DERisek, BSchrader, WT 5-benzylidene-1,2-dihydrochromeno[3,4-f]quinolines as selective progesterone receptor modulators. J Med Chem46:4104-12 (2003) 
 
Progesterone receptor
Name:Progesterone receptor
Type:Protein
Mol. Mass.:98979.52
Organism:Homo sapiens (Human)
Description:P06401
Residue:933
BDBM50133139
NameBDBM50133139
Synonyms:9-Fluoro-5-[1-(2-fluoro-phenyl)-meth-(Z)-ylidene]-2,2,4-trimethyl-2,5-dihydro-1H-6-oxa-1-aza-chrysene | CHEMBL335249
TypeSmall organic molecule
Emp. Form.C26H21F2NO
Mol. Mass.401.4478
SMILESCC1=CC(C)(C)Nc2ccc3-c4cc(F)ccc4O\C(=C/c4ccccc4F)c3c12