Reaction Details
TargetProgesterone receptor
LigandBDBM50133133
Substrate/Competitorn/a
Meas. Tech.ChEMBL_159730 (CHEMBL766187)
Ki 1.5±n/a nM
Citation Zhi, LTegley, CMPio, BEdwards, JPMotamedi, MJones, TKMarschke, KBMais, DERisek, BSchrader, WT 5-benzylidene-1,2-dihydrochromeno[3,4-f]quinolines as selective progesterone receptor modulators. J Med Chem46:4104-12 (2003) 
 
Progesterone receptor
Name:Progesterone receptor
Type:Protein
Mol. Mass.:98979.52
Organism:Homo sapiens (Human)
Description:P06401
Residue:933
BDBM50133133
NameBDBM50133133
Synonyms:7-Fluoro-2,2,4-trimethyl-5-[1-o-tolyl-meth-(Z)-ylidene]-2,5-dihydro-1H-6-oxa-1-aza-chrysene | CHEMBL337856
TypeSmall organic molecule
Emp. Form.C27H24FNO
Mol. Mass.397.484
SMILESCC1=CC(C)(C)Nc2ccc3-c4cccc(F)c4O\C(=C/c4ccccc4C)c3c12