Reaction Details
TargetProtein kinase C delta type
LigandBDBM50133240
Substrate/Competitorn/a
Meas. Tech.ChEMBL_160777 (CHEMBL766317)
Ki 22±n/a nM
Citation Sridhar, JWei, ZLNowak, ILewin, NEAyres, JAPearce, LVBlumberg, PMKozikowski, AP New bivalent PKC ligands linked by a carbon spacer: enhancement in binding affinity. J Med Chem46:4196-204 (2003) 
 
Protein kinase C delta type
Name:Protein kinase C delta type
Type:PROTEIN
Mol. Mass.:77554.99
Organism:Mus musculus
Description:ChEMBL_1351519
Residue:674
BDBM50133240
NameBDBM50133240
Synonyms:CHEMBL135611 | Decanedioic acid ((2S,5S)-5-hydroxymethyl-2-isopropyl-1-methyl-3-oxo-1,2,3,4,5,6-hexahydro-benzo[e][1,4]diazocin-8-yl)-amide (4-hydroxy-naphthalen-1-yl)-amide
TypeSmall organic molecule
Emp. Form.C35H46N4O5
Mol. Mass.602.7635
SMILESCC(C)[C@@H]1N(C)c2ccc(NC(=O)CCCCCCCCC(=O)Nc3ccc(O)c4ccccc34)cc2C[C@@H](CO)NC1=O