Reaction Details
TargetReceptor-type tyrosine-protein phosphatase alpha
LigandBDBM50133279
Substrate/Competitorn/a
Meas. Tech.ChEMBL_207129 (CHEMBL805113)
Ki 634000±n/a nM
Citation Liu, GXin, ZPei, ZHajduk, PJAbad-Zapatero, CHutchins, CWZhao, HLubben, THBallaron, SJHaasch, DLKaszubska, WRondinone, CMTrevillyan, JMJirousek, MR Fragment screening and assembly: a highly efficient approach to a selective and cell active protein tyrosine phosphatase 1B inhibitor. J Med Chem46:4232-5 (2003) 
 
Receptor-type tyrosine-protein phosphatase alpha
Name:Receptor-type tyrosine-protein phosphatase alpha
Type:Enzyme
Mol. Mass.:90719.02
Organism:Homo sapiens (Human)
Description:P18433
Residue:802
BDBM50133279
NameBDBM50133279
Synonyms:5-(3-Butyrylamino-phenyl)-isoxazole-3-carboxylic acid CHEMBL333158
TypeSmall organic molecule
Emp. Form.C14H14N2O4
Mol. Mass.274.272
SMILESCCCC(=O)Nc1cccc(c1)-c1cc(no1)C(O)=O