Reaction Details
TargetReceptor-type tyrosine-protein phosphatase alpha
LigandBDBM50133280
Substrate/Competitorn/a
Meas. Tech.ChEMBL_207129 (CHEMBL805113)
Ki 202000±n/a nM
Citation Liu, GXin, ZPei, ZHajduk, PJAbad-Zapatero, CHutchins, CWZhao, HLubben, THBallaron, SJHaasch, DLKaszubska, WRondinone, CMTrevillyan, JMJirousek, MR Fragment screening and assembly: a highly efficient approach to a selective and cell active protein tyrosine phosphatase 1B inhibitor. J Med Chem46:4232-5 (2003) 
 
Receptor-type tyrosine-protein phosphatase alpha
Name:Receptor-type tyrosine-protein phosphatase alpha
Type:Enzyme
Mol. Mass.:90719.02
Organism:Homo sapiens (Human)
Description:P18433
Residue:802
BDBM50133280
NameBDBM50133280
Synonyms:5-(3-(3-(3-hydroxy-2-(methoxycarbonyl)phenoxy)prop-1-enyl)phenyl)isoxazole-3-carboxylic acid CHEMBL133541 | isochroman-3-(S)-carboxylic acid methylester
TypeSmall organic molecule
Emp. Form.C21H17NO7
Mol. Mass.395.3622
SMILESCOC(=O)c1c(O)cccc1OC\C=C\c1cccc(c1)-c1cc(no1)C(O)=O