Reaction Details
TargetLanosterol synthase
LigandBDBM50095601
Substrate/Competitorn/a
Meas. Tech.ChEMBL_148893 (CHEMBL758674)
IC50 22±n/a nM
Citation Hinshaw, JCSuh, DYGarnier, PBuckner, FSEastman, RTMatsuda, SPJoubert, BMCoppens, IJoiner, KAMerali, SNash, TEPrestwich, GD Oxidosqualene cyclase inhibitors as antimicrobial agents. J Med Chem46:4240-3 (2003) 
 
Lanosterol synthase
Name:Lanosterol synthase
Type:PROTEIN
Mol. Mass.:83309.32
Organism:Homo sapiens (Human)
Description:ChEMBL_11231
Residue:732
BDBM50095601
NameBDBM50095601
Synonyms:CHEMBL25405 | [4-(1-Aza-bicyclo[2.2.2]oct-3-yloxy)-phenyl]-(4-chloro-phenyl)-methanone
TypeSmall organic molecule
Emp. Form.C20H20ClNO2
Mol. Mass.341.831
SMILESClc1ccc(cc1)C(=O)c1ccc(OC2CN3CCC2CC3)cc1