Reaction Details
TargetGlycogen phosphorylase, liver form
LigandBDBM50133431
Substrate/Competitorn/a
Meas. Tech.ChEMBL_99042 (CHEMBL712595)
IC50 8±n/a nM
Citation Ogawa, AKWilloughby, CABergeron, REllsworth, KPGeissler, WMMyers, RWYao, JHarris, GChapman, KT Glucose-lowering in a db/db mouse model by dihydropyridine diacid glycogen phosphorylase inhibitors. Bioorg Med Chem Lett13:3405-8 (2003) Glycogen phosphorylase, liver form
Name:Glycogen phosphorylase, liver form
Type:Homodimer
Mol. Mass.:97153.98
Organism:Homo sapiens (Human)
Description:Dimers associate into a tetramer to form the enzymatically active phosphorylase A.
Residue:847
BDBM50133431
NameBDBM50133431
Synonyms:1-(3-Chloro-benzyl)-4-(2-chloro-phenyl)-6-methyl-1,4-dihydro-pyridine-2,3,5-tricarboxylic acid 5-isopropyl ester | CHEMBL113762
TypeSmall organic molecule
Emp. Form.C25H23Cl2NO6
Mol. Mass.504.359
SMILESCC(C)OC(=O)C1=C(C)N(Cc2cccc(Cl)c2)C(C(O)=O)=C(C1c1ccccc1Cl)C(O)=O