Reaction Details
TargetGlycogen phosphorylase, muscle form
LigandBDBM50133432
Substrate/Competitorn/a
Meas. Tech.ChEMBL_138359 (CHEMBL873438)
IC50 41±n/a nM
Citation Ogawa, AKWilloughby, CABergeron, REllsworth, KPGeissler, WMMyers, RWYao, JHarris, GChapman, KT Glucose-lowering in a db/db mouse model by dihydropyridine diacid glycogen phosphorylase inhibitors. Bioorg Med Chem Lett13:3405-8 (2003) Glycogen phosphorylase, muscle form
Name:Glycogen phosphorylase, muscle form
Type:PROTEIN
Mol. Mass.:97097.45
Organism:Homo sapiens (Human)
Description:ChEMBL_1449751
Residue:842
BDBM50133432
NameBDBM50133432
Synonyms:4-(2-Chloro-phenyl)-1-(3,4-dichloro-benzyl)-6-methyl-1,4-dihydro-pyridine-2,3,5-tricarboxylic acid 5-isopropyl ester | CHEMBL334272
TypeSmall organic molecule
Emp. Form.C25H22Cl3NO6
Mol. Mass.538.804
SMILESCC(C)OC(=O)C1=C(C)N(Cc2ccc(Cl)c(Cl)c2)C(C(O)=O)=C(C1c1ccccc1Cl)C(O)=O