Reaction Details
TargetGlycogen phosphorylase, liver form
LigandBDBM50133438
Substrate/Competitorn/a
Meas. Tech.ChEMBL_99042 (CHEMBL712595)
IC50 4±n/a nM
Citation Ogawa, AKWilloughby, CABergeron, REllsworth, KPGeissler, WMMyers, RWYao, JHarris, GChapman, KT Glucose-lowering in a db/db mouse model by dihydropyridine diacid glycogen phosphorylase inhibitors. Bioorg Med Chem Lett13:3405-8 (2003) Glycogen phosphorylase, liver form
Name:Glycogen phosphorylase, liver form
Type:Homodimer
Mol. Mass.:97153.98
Organism:Homo sapiens (Human)
Description:Dimers associate into a tetramer to form the enzymatically active phosphorylase A.
Residue:847
BDBM50133438
NameBDBM50133438
Synonyms:4-(2-Chloro-phenyl)-1-(3,4-dimethoxy-benzyl)-6-methyl-1,4-dihydro-pyridine-2,3,5-tricarboxylic acid 5-isopropyl ester | CHEMBL115341
TypeSmall organic molecule
Emp. Form.C27H28ClNO8
Mol. Mass.529.966
SMILESCOc1ccc(CN2C(C)=C(C(C(C(O)=O)=C2C(O)=O)c2ccccc2Cl)C(=O)OC(C)C)cc1OC