Reaction Details
TargetGlycogen phosphorylase, liver form
LigandBDBM50133443
Substrate/Competitorn/a
Meas. Tech.ChEMBL_99042 (CHEMBL712595)
IC50 7.88±n/a nM
Citation Ogawa, AKWilloughby, CABergeron, REllsworth, KPGeissler, WMMyers, RWYao, JHarris, GChapman, KT Glucose-lowering in a db/db mouse model by dihydropyridine diacid glycogen phosphorylase inhibitors. Bioorg Med Chem Lett13:3405-8 (2003) Glycogen phosphorylase, liver form
Name:Glycogen phosphorylase, liver form
Type:Homodimer
Mol. Mass.:97153.98
Organism:Homo sapiens (Human)
Description:Dimers associate into a tetramer to form the enzymatically active phosphorylase A.
Residue:847
BDBM50133443
NameBDBM50133443
Synonyms:4-(2-Chloro-phenyl)-1-ethyl-5-isobutylcarbamoyl-6-methyl-1,4-dihydro-pyridine-2,3-dicarboxylic acid | CHEMBL113736
TypeSmall organic molecule
Emp. Form.C21H25ClN2O5
Mol. Mass.420.887
SMILESCCN1C(C)=C(C(C(C(O)=O)=C1C(O)=O)c1ccccc1Cl)C(=O)NCC(C)C