Reaction Details
TargetGlycogen phosphorylase, muscle form
LigandBDBM50133438
Substrate/Competitorn/a
Meas. Tech.ChEMBL_138359 (CHEMBL873438)
IC50 11±n/a nM
Citation Ogawa, AKWilloughby, CABergeron, REllsworth, KPGeissler, WMMyers, RWYao, JHarris, GChapman, KT Glucose-lowering in a db/db mouse model by dihydropyridine diacid glycogen phosphorylase inhibitors. Bioorg Med Chem Lett13:3405-8 (2003) Glycogen phosphorylase, muscle form
Name:Glycogen phosphorylase, muscle form
Type:PROTEIN
Mol. Mass.:97097.45
Organism:Homo sapiens (Human)
Description:ChEMBL_1449751
Residue:842
BDBM50133438
NameBDBM50133438
Synonyms:4-(2-Chloro-phenyl)-1-(3,4-dimethoxy-benzyl)-6-methyl-1,4-dihydro-pyridine-2,3,5-tricarboxylic acid 5-isopropyl ester | CHEMBL115341
TypeSmall organic molecule
Emp. Form.C27H28ClNO8
Mol. Mass.529.966
SMILESCOc1ccc(CN2C(C)=C(C(C(C(O)=O)=C2C(O)=O)c2ccccc2Cl)C(=O)OC(C)C)cc1OC