Reaction Details
Target5-hydroxytryptamine receptor 1D
LigandBDBM50133462
Substrate/Competitorn/a
Meas. Tech.ChEMBL_1718 (CHEMBL616924)
Ki 0.38±n/a nM
Citation Egle, IMacLean, NDemchyshyn, LEdwards, LSlassi, ATehim, A (R)-3-(N-methylpyrrolidin-2-ylmethyl)-5-(1,2,3,6-tetrahydropyridin-4-yl)-1H-indole derivatives as high affinity h5-HT1B/1D ligands. Bioorg Med Chem Lett13:3419-21 (2003) 5-hydroxytryptamine receptor 1D
Name:5-hydroxytryptamine receptor 1D
Type:G Protein-Coupled Receptor (GPCR)
Mol. Mass.:41920.63
Organism:Homo sapiens (Human)
Description:Receptor binding assays were performed using human clone stably expressed in CHO cells.
Residue:377
BDBM50133462
NameBDBM50133462
Synonyms:4-[3-((R)-1-Methyl-pyrrolidin-2-ylmethyl)-1H-indol-5-yl]-3,6-dihydro-2H-pyridine-1-carbothioic acid p-tolylamide | CHEMBL113950
TypeSmall organic molecule
Emp. Form.C27H32N4S
Mol. Mass.444.635
SMILESCN1CCC[C@@H]1Cc1c[nH]c2ccc(cc12)C1=CCN(CC1)C(=S)Nc1ccc(C)cc1