Reaction Details
TargetProthrombin
LigandBDBM50133529
Substrate/Competitorn/a
Meas. Tech.ChEBML_208918
Ki 0.046000±n/a nM
Citation Rittle, KEBarrow, JCCutrona, KJGlass, KLKrueger, JAKuo, LCLewis, SDLucas, BJMcMasters, DRMorrissette, MMNantermet, PGNewton, CLSanders, WMYan, YVacca, JPSelnick, HG Unexpected enhancement of thrombin inhibitor potency with o-aminoalkylbenzylamides in the P1 position. Bioorg Med Chem Lett13:3477-82 (2003) Prothrombin
Name:Prothrombin
Type:Protein
Mol. Mass.:70029.57
Organism:Homo sapiens (Human)
Description:P00734
Residue:622
BDBM50133529
NameBDBM50133529
Synonyms:CHEMBL420682 | N-(2-Aminomethyl-5-chloro-benzyl)-2-(6-methyl-2-oxo-3-phenylmethanesulfonylamino-2H-pyridin-1-yl)-acetamide
TypeSmall organic molecule
Emp. Form.C23H25ClN4O4S
Mol. Mass.488.987
SMILESCc1ccc(NS(=O)(=O)Cc2ccccc2)c(=O)n1CC(=O)NCc1cc(Cl)ccc1CN