Reaction Details
TargetCannabinoid receptor 1
LigandBDBM50133545
Substrate/Competitorn/a
Meas. Tech.ChEMBL_46457 (CHEMBL657904)
Ki 297.0±n/a nM
Citation Krishnamurthy, MFerreira, AMMoore, BM Synthesis and testing of novel phenyl substituted side-chain analogues of classical cannabinoids. Bioorg Med Chem Lett13:3487-90 (2003) Cannabinoid receptor 1
Name:Cannabinoid receptor 1
Type:G Protein-Coupled Receptor (GPCR)
Mol. Mass.:52868.96
Organism:Homo sapiens (Human)
Description:P21554
Residue:472
BDBM50133545
NameBDBM50133545
Synonyms:((6aR,10aR)-1-Hydroxy-6,6,9-trimethyl-6a,7,10,10a-tetrahydro-6H-benzo[c]chromen-3-yl)-phenyl-methanone | CHEMBL116784
TypeSmall organic molecule
Emp. Form.C23H24O3
Mol. Mass.348.4349
SMILESCC1=CC[C@@H]2[C@@H](C1)c1c(O)cc(cc1OC2(C)C)C(=O)c1ccccc1