Reaction Details
TargetCannabinoid receptor 2
LigandBDBM50133548
Substrate/Competitorn/a
Meas. Tech.ChEBML_46989
Ki 86±n/a nM
Citation Krishnamurthy, MFerreira, AMMoore, BM Synthesis and testing of novel phenyl substituted side-chain analogues of classical cannabinoids. Bioorg Med Chem Lett13:3487-90 (2003) Cannabinoid receptor 2
Name:Cannabinoid receptor 2
Type:G Protein-Coupled Receptor (GPCR)
Mol. Mass.:39690.94
Organism:Homo sapiens (Human)
Description:P34972
Residue:360
BDBM50133548
NameBDBM50133548
Synonyms:(6aR,10aR)-3-Benzyl-6,6,9-trimethyl-6a,7,10,10a-tetrahydro-6H-benzo[c]chromen-1-ol | CHEMBL408123
TypeSmall organic molecule
Emp. Form.C23H26O2
Mol. Mass.334.4513
SMILESCC1=CC[C@@H]2[C@@H](C1)c1c(O)cc(Cc3ccccc3)cc1OC2(C)C