Reaction Details
TargetNeuropeptide Y receptor type 5
LigandBDBM50133771
Substrate/Competitorn/a
Meas. Tech.ChEBML_144129
Ki 4769±n/a nM
Citation Elliott, RLOliver, RMLaFlamme, JAGillaspy, MLHammond, MHank, RFMaurer, TSBaker, DLDaSilva-Jardine, PAStevenson, RWMack, CMCassella, JV Structure-activity relationship studies on 2-heteroaryl-4-arylimidazoles NPY5 receptor antagonists. Bioorg Med Chem Lett13:3593-6 (2003) Neuropeptide Y receptor type 5
Name:Neuropeptide Y receptor type 5
Type:Enzyme
Mol. Mass.:50746.64
Organism:Homo sapiens (Human)
Description:Q15761
Residue:445
BDBM50133771
NameBDBM50133771
Synonyms:3-[5-(3,4-Dichloro-phenyl)-1H-imidazol-2-yl]-isoquinoline | CHEMBL116488
TypeSmall organic molecule
Emp. Form.C18H11Cl2N3
Mol. Mass.340.206
SMILESClc1ccc(cc1Cl)-c1c[nH]c(n1)-c1cc2ccccc2cn1