Reaction Details
TargetNeuropeptide Y receptor type 5
LigandBDBM50133778
Substrate/Competitorn/a
Meas. Tech.ChEBML_144129
Ki 34±n/a nM
Citation Elliott, RLOliver, RMLaFlamme, JAGillaspy, MLHammond, MHank, RFMaurer, TSBaker, DLDaSilva-Jardine, PAStevenson, RWMack, CMCassella, JV Structure-activity relationship studies on 2-heteroaryl-4-arylimidazoles NPY5 receptor antagonists. Bioorg Med Chem Lett13:3593-6 (2003) Neuropeptide Y receptor type 5
Name:Neuropeptide Y receptor type 5
Type:Enzyme
Mol. Mass.:50746.64
Organism:Homo sapiens (Human)
Description:Q15761
Residue:445
BDBM50133778
NameBDBM50133778
Synonyms:2,4(5)-Diphenylimidazole 2,5-Diphenyl-1H-imidazole | CHEMBL327027
TypeSmall organic molecule
Emp. Form.C15H12N2
Mol. Mass.220.2692
SMILESc1[nH]c(nc1-c1ccccc1)-c1ccccc1