Reaction Details
TargetGonadotropin-releasing hormone receptor
LigandBDBM50133840
Substrate/Competitorn/a
Meas. Tech.ChEBML_71591
Ki 36±n/a nM
Citation Guo, ZChen, YWu, DZhu, YFStruthers, RSSaunders, JXie, QChen, C Synthesis and structure-activity relationships of thieno[2,3-d]pyrimidine-2,4-dione derivatives as potent GnRH receptor antagonists. Bioorg Med Chem Lett13:3617-22 (2003) Gonadotropin-releasing hormone receptor
Name:Gonadotropin-releasing hormone receptor
Type:Enzyme
Mol. Mass.:37749.45
Organism:Homo sapiens (Human)
Description:P30968
Residue:328
BDBM50133840
NameBDBM50133840
Synonyms:1-(2,6-difluorobenzyl)-6-(4-aminophenyl)-5-((benzyl(methyl)amino)methyl)-3-phenylthieno[2,3-d]pyrimidine-2,4(1H,3H)-dione CHEMBL332138
TypeSmall organic molecule
Emp. Form.C34H28F2N4O2S
Mol. Mass.594.674
SMILESCN(Cc1c(sc2n(Cc3c(F)cccc3F)c(=O)n(-c3ccccc3)c(=O)c12)-c1ccc(N)cc1)Cc1ccccc1