Reaction Details
TargetGonadotropin-releasing hormone receptor
LigandBDBM50133843
Substrate/Competitorn/a
Meas. Tech.ChEBML_71591
Ki 11±n/a nM
Citation Guo, ZChen, YWu, DZhu, YFStruthers, RSSaunders, JXie, QChen, C Synthesis and structure-activity relationships of thieno[2,3-d]pyrimidine-2,4-dione derivatives as potent GnRH receptor antagonists. Bioorg Med Chem Lett13:3617-22 (2003) Gonadotropin-releasing hormone receptor
Name:Gonadotropin-releasing hormone receptor
Type:Enzyme
Mol. Mass.:37749.45
Organism:Homo sapiens (Human)
Description:P30968
Residue:328
BDBM50133843
NameBDBM50133843
Synonyms:5-[(Benzyl-methyl-amino)-methyl]-1-(2,6-difluoro-benzyl)-6-(4-ethylamino-phenyl)-3-phenyl-1H-thieno[2,3-d]pyrimidine-2,4-dione | CHEMBL332463
TypeSmall organic molecule
Emp. Form.C36H32F2N4O2S
Mol. Mass.622.727
SMILESCCNc1ccc(cc1)-c1sc2n(Cc3c(F)cccc3F)c(=O)n(-c3ccccc3)c(=O)c2c1CN(C)Cc1ccccc1